Please note that Sahi's development and support teams do not actively monitor this. This is more a community forum. If you are a Sahi Pro user looking for commercial support, please email support @ sahipro.com with your query.

'Publish JUnit test result report' changed build result to FAILURE (Build failure with Jenkins)

noddynoddy Members
edited February 2013 in Sahi Pro
Building in workspace /home/dev/dev_tools/Jenkins_workspace/workspace/SahiPro/userdata/scripts
Recording test results
No test report files were found. Configuration error?
Build step 'Publish JUnit test result report' changed build result to FAILURE
Finished: FAILURE

Answers

Sign In or Register to comment.